use bracket notation to access the json object

5 jobs for master in 2 minutes and 4 seconds
Status Name Job ID Coverage
  Build
passed build #233527

00:00:30

 
  Test
failed test #233528

00:01:34

 
  Code Quality Analysis
skipped code_anaylsis #233529
 
  Deploy
skipped deploy #233530
 
  Trigger Marketplace Server
skipped trigger
 
Name Stage Failure
failed
test Test
[ERROR] Failed to execute goal com.github.eirslett:frontend-maven-plugin:1.9.1:karma (unit and integration tests) on project helmholtz-marketplace-webapp: Failed to run task: 'karma start karma.conf.js' failed. org.apache.commons.exec.ExecuteException: Process exited with an error: 1 (Exit value: 1) -> [Help 1]
[ERROR]
[ERROR] To see the full stack trace of the errors, re-run Maven with the -e switch.
[ERROR] Re-run Maven using the -X switch to enable full debug logging.
[ERROR]
[ERROR] For more information about the errors and possible solutions, please read the following articles:
[ERROR] [Help 1] http://cwiki.apache.org/confluence/display/MAVEN/MojoFailureException
Cleaning up file based variables
ERROR: Job failed: exit code 1