.

2 jobs for cf_tests_ci in 1 minute and 7 seconds (queued for 8 seconds)
Name Stage Failure
failed
test Test
E            +  where False = <function writeUUIDtoVideo at 0x7f07777ea3a0>('/builds/datahub/marehub/ag-videosimages/mariqt/tests/TestFiles/test_video.mkv', copy=True, test_val='b1b0b067-c8b6-4f88-bca3-96eb0a01441a')
E + where <function writeUUIDtoVideo at 0x7f07777ea3a0> = miqti.writeUUIDtoVideo

tests/test_unitTests.py:299: AssertionError
=========================== short test summary info ============================
FAILED tests/test_unitTests.py::Test_image::test_video_uuid - AssertionError:...
========================= 1 failed, 24 passed in 0.61s =========================
Cleaning up project directory and file based variables
ERROR: Job failed: exit code 1